*Heading
** Job name: rve_cube_test Model name: Model-1
** Generated by: Abaqus/CAE 2017
*Preprint, echo=NO, model=NO, history=NO, contact=NO
**
** PARTS
**
*Part, name=Part-1
*Node
*Element, type=C3D8R
*Nset, nset=Set-1, generate
*Elset, elset=Set-1, generate
*Distribution, name=Ori-1-DiscOrient, location=ELEMENT, Table=Ori-1-DiscOrient_Table
** Description: Distribution generated from Discrete Orientation
*Orientation, name=Ori-1, system=RECTANGULAR
Ori-1-DiscOrient
** Section: Section-1
*Solid Section, elset=Set-1, orientation=Ori-1, material=Material-1
*End Part
**
**
** ASSEMBLY
**
*Assembly, name=Assembly
**
*Instance, name=Part-1-1, part=Part-1
*End Instance
**
*End Assembly
*Distribution Table, name=Ori-1-DiscOrient_Table
coord3D, coord3D
**
** MATERIALS
**
*Material, name=Material-1
*Elastic, type=ENGINEERING CONSTANTS
1.,   2.,   3.,   0.,   0.,   0., 0.12, 0.13
 0.23,