*Heading
** Job name: sg2_airfoil Model name: Model-1
** Generated by: Abaqus/CAE 2017
*Preprint, echo=NO, model=NO, history=NO, contact=NO
**
** PARTS
**
*Part, name=Part-1
*Node
*Element, type=CPS3
*Element, type=CPS4R
*Nset, nset=Set-1
*Elset, elset=Set-1, generate
*Nset, nset=Set-2
*Elset, elset=Set-2, generate
*Nset, nset=Set-3
*Elset, elset=Set-3, generate
*Nset, nset=Set-4
*Elset, elset=Set-4, generate
*Nset, nset=Set-5
*Elset, elset=Set-5, generate
*Nset, nset=Set-6
*Elset, elset=Set-6
*Nset, nset=Set-8
*Elset, elset=Set-8
*Nset, nset=Set-10
*Elset, elset=Set-10
*Nset, nset=Set-12
*Elset, elset=Set-12
*Nset, nset=Set-14
*Elset, elset=Set-14
*Distribution, name=Ori-1-DiscOrient, location=ELEMENT, Table=Ori-1-DiscOrient_Table
** Description: Distribution generated from Discrete Orientation
*Distribution, name=Ori-2-DiscOrient, location=ELEMENT, Table=Ori-2-DiscOrient_Table
** Description: Distribution generated from Discrete Orientation
*Distribution, name=Ori-3-DiscOrient, location=ELEMENT, Table=Ori-3-DiscOrient_Table
** Description: Distribution generated from Discrete Orientation
*Distribution, name=Ori-4-DiscOrient, location=ELEMENT, Table=Ori-4-DiscOrient_Table
** Description: Distribution generated from Discrete Orientation
*Distribution, name=Ori-5-DiscOrient, location=ELEMENT, Table=Ori-5-DiscOrient_Table
** Description: Distribution generated from Discrete Orientation
*Orientation, name=Ori-1, system=RECTANGULAR
Ori-1-DiscOrient
** Region: (CompositeLayup-1-1: Generated From Layup)
*Elset, elset=CompositeLayup-1-1, generate
** Section: CompositeLayup-1-1
*Solid Section, elset=CompositeLayup-1-1, composite, orientation=Ori-1, stack direction=3, layup=CompositeLayup-1
1., 1, cfrp, 0., Ply-1
*Orientation, name=Ori-4, system=RECTANGULAR
Ori-4-DiscOrient
** Region: (CompositeLayup-4-1: Generated From Layup)
*Elset, elset=CompositeLayup-4-1, generate
** Section: CompositeLayup-4-1
*Solid Section, elset=CompositeLayup-4-1, composite, orientation=Ori-4, stack direction=3, layup=CompositeLayup-4
1., 1, cfrp, 0., Ply-1
*Orientation, name=Ori-3, system=RECTANGULAR
Ori-3-DiscOrient
** Region: (CompositeLayup-3-1: Generated From Layup)
*Elset, elset=CompositeLayup-3-1, generate
** Section: CompositeLayup-3-1
*Solid Section, elset=CompositeLayup-3-1, composite, orientation=Ori-3, stack direction=3, layup=CompositeLayup-3
1., 1, cfrp, 45., Ply-1
** Section: coat
*Solid Section, elset=Set-1, material=coat
** Section: al
*Solid Section, elset=Set-3, material=al
** Section: foam
*Solid Section, elset=Set-4, material=foam
*Orientation, name=Ori-5, system=RECTANGULAR
Ori-5-DiscOrient
** Region: (CompositeLayup-5-1: Generated From Layup)
*Elset, elset=CompositeLayup-5-1, generate
** Section: CompositeLayup-5-1
*Solid Section, elset=CompositeLayup-5-1, composite, orientation=Ori-5, stack direction=3, layup=CompositeLayup-5
1., 1, cfrp, -45., Ply-1
*Orientation, name=Ori-2, system=RECTANGULAR
Ori-2-DiscOrient
** Region: (CompositeLayup-2-1: Generated From Layup)
*Elset, elset=CompositeLayup-2-1, generate
** Section: CompositeLayup-2-1
*Solid Section, elset=CompositeLayup-2-1, composite, orientation=Ori-2, stack direction=3, layup=CompositeLayup-2
1., 1, cfrp, 0., Ply-1
** Section: honeycomb
*Solid Section, elset=Set-5, material=honeycomb
*End Part
**
**
** ASSEMBLY
**
*Assembly, name=Assembly
**
*Instance, name=Part-1-1, part=Part-1
*End Instance
**
*End Assembly
*Distribution Table, name=Ori-1-DiscOrient_Table
coord3D, coord3D
*Distribution Table, name=Ori-2-DiscOrient_Table
coord3D, coord3D
*Distribution Table, name=Ori-3-DiscOrient_Table
coord3D, coord3D
*Distribution Table, name=Ori-4-DiscOrient_Table
coord3D, coord3D
*Distribution Table, name=Ori-5-DiscOrient_Table
coord3D, coord3D
**
** MATERIALS
**
*Material, name=al
*Density
 5.6393,
*Elastic
 1.8864e+09, 0.33
*Material, name=cfrp
*Density
 3.10451,
*Elastic, type=ENGINEERING CONSTANTS
 2.8224e+09, 1.9296e+08, 1.9296e+08,      0.348,      0.348,        0.3, 1.3104e+08, 1.3104e+08
  7.422e+07,
*Material, name=coat
*Density
1.,
*Elastic
1., 0.3
*Material, name=foam
*Density
 0.146,
*Elastic, type=ENGINEERING CONSTANTS
 1.89e+06, 1.89e+06, 1.89e+06,    0.315,    0.315,      0.3,  593000.,  593000.
  593000.,
*Material, name=honeycomb
*Density
 0.0935,
*Elastic, type=ENGINEERING CONSTANTS
144000.,  144000., 2.88e+06,      0.3,     0.01,     0.01,  144000.,  835000.
  504000.,